Reaction Details
TargetC-C chemokine receptor type 5
LigandBDBM50106991
Substrate/Competitorn/a
Meas. Tech.ChEMBL_39504 (CHEMBL654033)
IC50 2±n/a nM
Citation Willoughby, CABerk, SCRosauer, KGDegrado, SChapman, KTGould, SLSpringer, MSMalkowitz, LSchleif, WAHazuda, DMiller, MKessler, JDanzeisen, RHolmes, KLineberger, JCarella, ACarver, GEmini, EA Combinatorial synthesis of CCR5 antagonists. Bioorg Med Chem Lett11:3137-41 (2001) C-C chemokine receptor type 5
Name:C-C chemokine receptor type 5
Type:Enzyme
Mol. Mass.:40540.21
Organism:Homo sapiens (Human)
Description:P51681
Residue:352
BDBM50106991
NameBDBM50106991
Synonyms:5-Pyridin-2-yl-thiophene-2-sulfonic acid methyl-{2-phenyl-4-[4-(3-phenyl-propyl)-piperidin-1-yl]-butyl}-amide | CHEMBL106569
TypeSmall organic molecule
Emp. Form.C34H41N3O2S2
Mol. Mass.587.838
SMILESCN(CC(CCN1CCC(CCCc2ccccc2)CC1)c1ccccc1)S(=O)(=O)c1ccc(s1)-c1ccccn1