Reaction Details
TargetC-C chemokine receptor type 5
LigandBDBM50096557
Substrate/Competitorn/a
Meas. Tech.ChEBML_39503
IC50 30±n/a nM
Citation Willoughby, CABerk, SCRosauer, KGDegrado, SChapman, KTGould, SLSpringer, MSMalkowitz, LSchleif, WAHazuda, DMiller, MKessler, JDanzeisen, RHolmes, KLineberger, JCarella, ACarver, GEmini, EA Combinatorial synthesis of CCR5 antagonists. Bioorg Med Chem Lett11:3137-41 (2001) C-C chemokine receptor type 5
Name:C-C chemokine receptor type 5
Type:Enzyme
Mol. Mass.:40540.21
Organism:Homo sapiens (Human)
Description:P51681
Residue:352
BDBM50096557
NameBDBM50096557
Synonyms:CHEMBL312701 N-[2-(3-Chloro-phenyl)-4-(4-phenyl-piperidin-1-yl)-butyl]-N-methyl-benzenesulfonamide
TypeSmall organic molecule
Emp. Form.C28H33ClN2O2S
Mol. Mass.497.092
SMILESCN(C[C@@H](CCN1CCC(CC1)c1ccccc1)c1cccc(Cl)c1)S(=O)(=O)c1ccccc1