Reaction Details
TargetC-C chemokine receptor type 5
LigandBDBM50106997
Substrate/Competitorn/a
Meas. Tech.ChEBML_39503
IC50 6.5±n/a nM
Citation Willoughby, CABerk, SCRosauer, KGDegrado, SChapman, KTGould, SLSpringer, MSMalkowitz, LSchleif, WAHazuda, DMiller, MKessler, JDanzeisen, RHolmes, KLineberger, JCarella, ACarver, GEmini, EA Combinatorial synthesis of CCR5 antagonists. Bioorg Med Chem Lett11:3137-41 (2001) C-C chemokine receptor type 5
Name:C-C chemokine receptor type 5
Type:Enzyme
Mol. Mass.:40540.21
Organism:Homo sapiens (Human)
Description:P51681
Residue:352
BDBM50106997
NameBDBM50106997
Synonyms:1-((3S,4S)-1-Cyclohexylmethyl-4-phenyl-pyrrolidin-3-ylmethyl)-4-(3-phenyl-propyl)-piperidine | CHEMBL321267
TypeSmall organic molecule
Emp. Form.C32H46N2
Mol. Mass.458.721
SMILESC(CC1CCN(C[C@H]2CN(CC3CCCCC3)C[C@@H]2c2ccccc2)CC1)Cc1ccccc1