Reaction Details
TargetApolipoprotein B-100
LigandBDBM50107797
Substrate/Competitorn/a
Meas. Tech.ChEMBL_217986 (CHEMBL824105)
IC50 1.2±n/a nM
Citation Ksander, GMdeJesus, RYuan, AFink, CMoskal, MCarlson, EKukkola, PBilci, NWallace, ENeubert, AFeldman, DMogelesky, TPoirier, KJeune, MSteele, RWasvery, JStephan, ZCahill, EWebb, RNavarrete, ALee, WGibson, JAlexander, NSharif, HHospattankar, A Diaminoindanes as microsomal triglyceride transfer protein inhibitors. J Med Chem44:4677-87 (2001) Apolipoprotein B-100
Name:Apolipoprotein B-100
Type:PROTEIN
Mol. Mass.:515630.53
Organism:Homo sapiens (Human)
Description:ChEMBL_217986
Residue:4563
BDBM50107797
NameBDBM50107797
Synonyms:4'-Fluoro-6-methyl-biphenyl-2-carboxylic acid (2-benzenesulfonylamino-indan-5-yl)-amide | CHEMBL344814
TypeSmall organic molecule
Emp. Form.C29H25FN2O3S
Mol. Mass.500.584
SMILESCc1cccc(C(=O)Nc2ccc3CC(Cc3c2)NS(=O)(=O)c2ccccc2)c1-c1ccc(F)cc1