Reaction Details
TargetApolipoprotein B-100
LigandBDBM50107801
Substrate/Competitorn/a
Meas. Tech.ChEMBL_217986 (CHEMBL824105)
IC50 270±n/a nM
Citation Ksander, GMdeJesus, RYuan, AFink, CMoskal, MCarlson, EKukkola, PBilci, NWallace, ENeubert, AFeldman, DMogelesky, TPoirier, KJeune, MSteele, RWasvery, JStephan, ZCahill, EWebb, RNavarrete, ALee, WGibson, JAlexander, NSharif, HHospattankar, A Diaminoindanes as microsomal triglyceride transfer protein inhibitors. J Med Chem44:4677-87 (2001) Apolipoprotein B-100
Name:Apolipoprotein B-100
Type:PROTEIN
Mol. Mass.:515630.53
Organism:Homo sapiens (Human)
Description:ChEMBL_217986
Residue:4563
BDBM50107801
NameBDBM50107801
Synonyms:4'-Trifluoromethyl-biphenyl-2-carboxylic acid (2-benzoylamino-indan-5-yl)-amide | CHEMBL143684
TypeSmall organic molecule
Emp. Form.C30H23F3N2O2
Mol. Mass.500.511
SMILESFC(F)(F)c1ccc(cc1)-c1ccccc1C(=O)Nc1ccc2CC(Cc2c1)NC(=O)c1ccccc1