Reaction Details
TargetMaltase-glucoamylase
LigandBDBM23406
Substrate/Competitorn/a
Meas. Tech.ChEMBL_2025601 (CHEMBL4679414)
IC50 15200±n/a nM
Citation Takashima, KSakano, MKinouchi, ENakamura, SMarumoto, SIshikawa, FNinomiya, KNakanishi, IMorikawa, TTanabe, G Elongation of the side chain by linear alkyl groups increases the potency of salacinol, a potent ?-glucosidase inhibitor from the Ayurvedic traditional medicine "Salacia," against human intestinal maltase. Bioorg Med Chem Lett33:0 (2021) 
 
Maltase-glucoamylase
Name:Maltase-glucoamylase
Type:Enzyme
Mol. Mass.:209817.06
Organism:Homo sapiens (Human)
Description:O43451
Residue:2753
BDBM23406
NameBDBM23406
Synonyms:(3R,4R,5S,6R)-5-{[(2R,3R,4R,5S,6R)-5-{[(2R,3R,4S,5S,6R)-3,4-dihydroxy-6-methyl-5-{[(1S,4R,5S,6S)-4,5,6-trihydroxy-3-(hydroxymethyl)cyclohex-2-en-1-yl]amino}oxan-2-yl]oxy}-3,4-dihydroxy-6-(hydroxymethyl)oxan-2-yl]oxy}-6-(hydroxymethyl)oxane-2,3,4-triol US11292789, Acarbose
TypeCarbohydrate
Emp. Form.C25H43NO18
Mol. Mass.645.6048
SMILESC[C@H]1O[C@H](O[C@@H]2[C@@H](CO)O[C@H](O[C@@H]3[C@@H](CO)OC(O)[C@H](O)[C@H]3O)[C@H](O)[C@H]2O)[C@H](O)[C@@H](O)[C@@H]1N[C@H]1C=C(CO)[C@@H](O)[C@H](O)[C@H]1O