Reaction Details
TargetKynurenine 3-monooxygenase
LigandBDBM50549705
Substrate/Competitorn/a
Meas. Tech.ChEMBL_2025623 (CHEMBL4679436)
IC50 17±n/a nM
Citation Kimura, HSuda, HKassai, MEndo, MDeai, YYahata, MMiyajima, MIsobe, Y N-(6-phenylpyridazin-3-yl)benzenesulfonamides as highly potent, brain-permeable, and orally active kynurenine monooxygenase inhibitors. Bioorg Med Chem Lett33:0 (2021) 
 
Kynurenine 3-monooxygenase
Name:Kynurenine 3-monooxygenase
Type:PROTEIN
Mol. Mass.:54550.12
Organism:Mus musculus
Description:ChEMBL_109577
Residue:479
BDBM50549705
NameBDBM50549705
Synonyms:CHEMBL4756311
TypeSmall organic molecule
Emp. Form.C20H20N4O2S
Mol. Mass.380.463
SMILESCN1CCc2cccc(c12)-c1ccc(NS(=O)(=O)c2ccc(C)cc2)nn1