Reaction Details
TargetKynurenine 3-monooxygenase
LigandBDBM50549715
Substrate/Competitorn/a
Meas. Tech.ChEMBL_2025623 (CHEMBL4679436)
IC50 4.5±n/a nM
Citation Kimura, HSuda, HKassai, MEndo, MDeai, YYahata, MMiyajima, MIsobe, Y N-(6-phenylpyridazin-3-yl)benzenesulfonamides as highly potent, brain-permeable, and orally active kynurenine monooxygenase inhibitors. Bioorg Med Chem Lett33:0 (2021) 
 
Kynurenine 3-monooxygenase
Name:Kynurenine 3-monooxygenase
Type:PROTEIN
Mol. Mass.:54550.12
Organism:Mus musculus
Description:ChEMBL_109577
Residue:479
BDBM50549715
NameBDBM50549715
Synonyms:CHEMBL4760680
TypeSmall organic molecule
Emp. Form.C19H20N4O2S
Mol. Mass.368.453
SMILESCN(C)c1ccccc1-c1ccc(NS(=O)(=O)c2ccc(C)cc2)nn1