Reaction Details
TargetKynurenine 3-monooxygenase
LigandBDBM50549721
Substrate/Competitorn/a
Meas. Tech.ChEMBL_2025623 (CHEMBL4679436)
IC50 101±n/a nM
Citation Kimura, HSuda, HKassai, MEndo, MDeai, YYahata, MMiyajima, MIsobe, Y N-(6-phenylpyridazin-3-yl)benzenesulfonamides as highly potent, brain-permeable, and orally active kynurenine monooxygenase inhibitors. Bioorg Med Chem Lett33:0 (2021) 
 
Kynurenine 3-monooxygenase
Name:Kynurenine 3-monooxygenase
Type:PROTEIN
Mol. Mass.:54550.12
Organism:Mus musculus
Description:ChEMBL_109577
Residue:479
BDBM50549721
NameBDBM50549721
Synonyms:CHEMBL4791546
TypeSmall organic molecule
Emp. Form.C17H14ClN3O2S
Mol. Mass.359.83
SMILESCc1cccc(c1)S(=O)(=O)Nc1ccc(nn1)-c1cccc(Cl)c1