Reaction Details
TargetPlasminogen activator inhibitor 1
LigandBDBM50111316
Substrate/Competitorn/a
Meas. Tech.ChEBML_222791
IC50 200±n/a nM
Citation Folkes, ABrown, SDCanne, LEChan, JEngelhardt, EEpshteyn, SFaint, RGolec, JHanel, AKearney, PLeahy, JWMac, MMatthews, DPrisbylla, MPSanderson, JSimon, RJTesfai, ZVicker, NWang, SWebb, RRCharlton, P Design, synthesis and in vitro evaluation of potent, novel, small molecule inhibitors of plasminogen activator inhibitor-1. Bioorg Med Chem Lett12:1063-6 (2002) Plasminogen activator inhibitor 1
Name:Plasminogen activator inhibitor 1
Type:Enzyme
Mol. Mass.:45064.00
Organism:Homo sapiens (Human)
Description:P05121
Residue:402
BDBM50111316
NameBDBM50111316
Synonyms:8-[4-(3,6-Dioxo-5-{4-[(thiophene-2-carbonyl)-amino]-benzylidene}-piperazin-2-ylidenemethyl)-phenoxy]-octanoic acid | CHEMBL10062
TypeSmall organic molecule
Emp. Form.C31H31N3O6S
Mol. Mass.573.659
SMILESOC(=O)CCCCCCCOc1ccc(\C=c2\[nH]c(=O)\c(=C\c3ccc(NC(=O)c4cccs4)cc3)[nH]c2=O)cc1