Reaction Details
TargetProto-oncogene tyrosine-protein kinase Src
LigandBDBM14675
Substrate/Competitorn/a
Meas. Tech.ChEBML_202783
IC50 2500000±n/a nM
Citation Deprez, PMandine, EGofflo, DMeunier, SLesuisse, D Small ligands interacting with the phosphotyrosine binding pocket of the Src SH2 protein. Bioorg Med Chem Lett12:1295-8 (2002) Proto-oncogene tyrosine-protein kinase Src
Name:Proto-oncogene tyrosine-protein kinase Src
Type:Protein
Mol. Mass.:59838.60
Organism:Homo sapiens (Human)
Description:P12931
Residue:536
BDBM14675
NameBDBM14675
Synonyms:CHEMBL26128 Phenylphosphate | phenoxyphosphonic acid
TypeSmall organic molecule
Emp. Form.C6H7O4P
Mol. Mass.174.0911
SMILESOP(O)(=O)Oc1ccccc1