Reaction Details
TargetTissue-type plasminogen activator
LigandBDBM50115874
Substrate/Competitorn/a
Meas. Tech.ChEBML_208242
Ki 35±n/a nM
Citation Mackman, RLHui, HCBreitenbucher, JGKatz, BALuong, CMartelli, AMcGee, DRadika, KSendzik, MSpencer, JRSprengeler, PATario, JVerner, EWang, J 2-(2-Hydroxy-3-alkoxyphenyl)-1H-benzimidazole-5-carboxamidine derivatives as potent and selective urokinase-type plasminogen activator inhibitors. Bioorg Med Chem Lett12:2019-22 (2002) Tissue-type plasminogen activator
Name:Tissue-type plasminogen activator
Type:Enzyme
Mol. Mass.:62931.08
Organism:Homo sapiens (Human)
Description:n/a
Residue:562
BDBM50115874
NameBDBM50115874
Synonyms:2-(2-Hydroxy-3-phenoxy-phenyl)-1H-indole-5-carboxamidine | CHEMBL59704
TypeSmall organic molecule
Emp. Form.C21H17N3O2
Mol. Mass.343.3786
SMILESNC(=N)c1ccc2[nH]c(cc2c1)-c1cccc(Oc2ccccc2)c1O