Reaction Details
TargetSubstance-P receptor
LigandBDBM50403920
Substrate/Competitorn/a
Meas. Tech.ChEBML_205391
IC50 0.800000±n/a nM
Citation Mah, RGerspacher, Mvon Sprecher, AStutz, STschinke, VAnderson, GPBertrand, CSubramanian, NBall, HA Biphenyl derivatives as novel dual NK(1)/NK(2)-receptor antagonists. Bioorg Med Chem Lett12:2065-8 (2002) Substance-P receptor
Name:Substance-P receptor
Type:G Protein-Coupled Receptor (GPCR)
Mol. Mass.:46254.43
Organism:Homo sapiens (Human)
Description:P25103
Residue:407
BDBM50403920
NameBDBM50403920
Synonyms:CHEMBL2112212
TypeSmall organic molecule
Emp. Form.C29H23Cl2F6N3O3
Mol. Mass.646.408
SMILESCN(C(=O)c1cc(cc(c1)C(F)(F)F)C(F)(F)F)c1cc(ccc1-c1ccc(Cl)c(Cl)c1)C(=O)N[C@@H]1CCCCNC1=O