Reaction Details
TargetDNA topoisomerase 2-alpha
LigandBDBM50127140
Substrate/Competitorn/a
Meas. Tech.ChEMBL_2053979 (CHEMBL4708980)
IC50 68300±n/a nM
Citation Catanzaro, EBetari, NArencibia, JMMontanari, SSissi, CDe Simone, AVassura, ISantini, AAndrisano, VTumiatti, VDe Vivo, MKrysko, DVRocchi, MBLFimognari, CMilelli, A Targeting topoisomerase II with trypthantrin derivatives: Discovery of 7-((2-(dimethylamino)ethyl)amino)indolo[2,1-b]quinazoline-6,12-dione as an antiproliferative agent and to treat cancer. Eur J Med Chem202:0 (2020) 
 
DNA topoisomerase 2-alpha
Name:DNA topoisomerase 2-alpha
Type:Protein
Mol. Mass.:174415.30
Organism:Homo sapiens (Human)
Description:P11388
Residue:1531
BDBM50127140
NameBDBM50127140
Synonyms:(-)-etoposide 4'-Demethylepipodophyllotoxin 9-(4,6-O-(R)-ethylidene-beta-D-glucopyranoside) 9-((4,6-O-Ethylidine-beta-D-glucopyranosyl)oxy)-5,8,8a,9-tetrahydro-5-(4-hydroxy-3,4-dimethyloxyphenyl)furo(3',4'':6,7)naptho-(2,3-d)-1,3-dioxol-6(5aH)-one Etoposide (ET) VP-16 | etoposide
TypeSmall organic molecule
Emp. Form.C29H32O13
Mol. Mass.588.5566
SMILESCOc1cc(cc(OC)c1O)[C@H]1[C@@H]2[C@H](COC2=O)[C@H](O[C@@H]2O[C@@H]3CO[C@@H](C)O[C@H]3[C@H](O)[C@H]2O)c2cc3OCOc3cc12