Reaction Details
TargetD(2) dopamine receptor
LigandBDBM50469504
Substrate/Competitorn/a
Meas. Tech.ChEMBL_2054829 (CHEMBL4709830)
Ki 2.9±n/a nM
Citation Jin, JZhang, KDou, FHao, CZhang, YCao, XGao, LXiong, JLiu, XLiu, BFZhang, GChen, Y Isoquinolinone derivatives as potent CNS multi-receptor D Eur J Med Chem207:0 (2020) 
 
D(2) dopamine receptor
Name:D(2) dopamine receptor
Type:Cell-surface receptors
Mol. Mass.:50647.10
Organism:Homo sapiens (Human)
Description:P14416
Residue:443
BDBM50469504
NameBDBM50469504
Synonyms:CHEMBL4293999
TypeSmall organic molecule
Emp. Form.C28H30FN3O3
Mol. Mass.475.5545
SMILESFc1ccc2c(noc2c1)C1CCN(CCCCC(=O)c2cc3CCN4c3c(CCC4=O)c2)CC1