Reaction Details
Target5-hydroxytryptamine receptor 2A
LigandBDBM50469504
Substrate/Competitorn/a
Meas. Tech.ChEMBL_2054832 (CHEMBL4709833)
Ki 0.720000±n/a nM
Citation Jin, JZhang, KDou, FHao, CZhang, YCao, XGao, LXiong, JLiu, XLiu, BFZhang, GChen, Y Isoquinolinone derivatives as potent CNS multi-receptor D Eur J Med Chem207:0 (2020) 
 
5-hydroxytryptamine receptor 2A
Name:5-hydroxytryptamine receptor 2A
Type:undefined
Mol. Mass.:52607.65
Organism:Homo sapiens (Human)
Description:P28223
Residue:471
BDBM50469504
NameBDBM50469504
Synonyms:CHEMBL4293999
TypeSmall organic molecule
Emp. Form.C28H30FN3O3
Mol. Mass.475.5545
SMILESFc1ccc2c(noc2c1)C1CCN(CCCCC(=O)c2cc3CCN4c3c(CCC4=O)c2)CC1