Reaction Details
Target5-hydroxytryptamine receptor 2A
LigandBDBM423299
Substrate/Competitorn/a
Meas. Tech.ChEMBL_2054841 (CHEMBL4709842)
Ki 0.650000±n/a nM
Citation Jin, JZhang, KDou, FHao, CZhang, YCao, XGao, LXiong, JLiu, XLiu, BFZhang, GChen, Y Isoquinolinone derivatives as potent CNS multi-receptor D Eur J Med Chem207:0 (2020) 
 
5-hydroxytryptamine receptor 2A
Name:5-hydroxytryptamine receptor 2A
Type:G Protein-Coupled Receptor (GPCR)
Mol. Mass.:52852.05
Organism:Rattus norvegicus (rat)
Description:Rat cortex membranes 5-HT2A receptors.
Residue:471
BDBM423299
NameBDBM423299
Synonyms:US10501452, Compound 5
TypeSmall organic molecule
Emp. Form.C25H28FN3O3
Mol. Mass.437.5065
SMILESCN1CCc2ccc(OCCCN3CCC(CC3)c3noc4cc(F)ccc34)cc2C1=O