Reaction Details
Target5-hydroxytryptamine receptor 2A
LigandBDBM50556105
Substrate/Competitorn/a
Meas. Tech.ChEMBL_2054841 (CHEMBL4709842)
Ki 3.5±n/a nM
Citation Jin, JZhang, KDou, FHao, CZhang, YCao, XGao, LXiong, JLiu, XLiu, BFZhang, GChen, Y Isoquinolinone derivatives as potent CNS multi-receptor D Eur J Med Chem207:0 (2020) 
 
5-hydroxytryptamine receptor 2A
Name:5-hydroxytryptamine receptor 2A
Type:G Protein-Coupled Receptor (GPCR)
Mol. Mass.:52852.05
Organism:Rattus norvegicus (rat)
Description:Rat cortex membranes 5-HT2A receptors.
Residue:471
BDBM50556105
NameBDBM50556105
Synonyms:CHEMBL4743324
TypeSmall organic molecule
Emp. Form.C25H26FN3O3
Mol. Mass.435.4906
SMILESCn1ccc2ccc(OCCCN3CCC(CC3)c3noc4cc(F)ccc34)cc2c1=O