Reaction Details
TargetProstaglandin E2 receptor EP2 subtype
LigandBDBM50117681
Substrate/Competitorn/a
Meas. Tech.ChEBML_158305
Ki 140±n/a nM
Citation Gallant, MCarrière, MCChateauneuf, ADenis, DGareau, YGodbout, CGreig, GJuteau, HLachance, NLacombe, PLamontagne, SMetters, KMRochette, CRuel, RSlipetz, DSawyer, NTremblay, NLabelle, M Structure-activity relationship of biaryl acylsulfonamide analogues on the human EP(3) prostanoid receptor. Bioorg Med Chem Lett12:2583-6 (2002) Prostaglandin E2 receptor EP2 subtype
Name:Prostaglandin E2 receptor EP2 subtype
Type:Enzyme
Mol. Mass.:39775.71
Organism:Homo sapiens (Human)
Description:P43116
Residue:358
BDBM50117681
NameBDBM50117681
Synonyms:3-(4'-Phenethylsulfanylmethyl-biphenyl-2-yl)-propionic acid | CHEMBL86799
TypeSmall organic molecule
Emp. Form.C24H24O2S
Mol. Mass.376.511
SMILESOC(=O)CCc1ccccc1-c1ccc(CSCCc2ccccc2)cc1