Reaction Details
TargetProstaglandin D2 receptor
LigandBDBM50117689
Substrate/Competitorn/a
Meas. Tech.ChEBML_158171
Ki 830.0±n/a nM
Citation Gallant, MCarrière, MCChateauneuf, ADenis, DGareau, YGodbout, CGreig, GJuteau, HLachance, NLacombe, PLamontagne, SMetters, KMRochette, CRuel, RSlipetz, DSawyer, NTremblay, NLabelle, M Structure-activity relationship of biaryl acylsulfonamide analogues on the human EP(3) prostanoid receptor. Bioorg Med Chem Lett12:2583-6 (2002) Prostaglandin D2 receptor
Name:Prostaglandin D2 receptor
Type:Enzyme
Mol. Mass.:40288.87
Organism:Homo sapiens (Human)
Description:Q13258
Residue:359
BDBM50117689
NameBDBM50117689
Synonyms:CHEMBL87371 | Thiophene-2-sulfonic acid [(E)-3-(3',4'-dichloro-biphenyl-2-yl)-acryloyl]-amide
TypeSmall organic molecule
Emp. Form.C19H13Cl2NO3S2
Mol. Mass.438.347
SMILESClc1ccc(cc1Cl)-c1ccccc1\C=C\C(=O)NS(=O)(=O)c1cccs1