Reaction Details
TargetProstaglandin E2 receptor EP3 subtype
LigandBDBM50117695
Substrate/Competitorn/a
Meas. Tech.ChEBML_158321
Ki 53.0±n/a nM
Citation Gallant, MCarrière, MCChateauneuf, ADenis, DGareau, YGodbout, CGreig, GJuteau, HLachance, NLacombe, PLamontagne, SMetters, KMRochette, CRuel, RSlipetz, DSawyer, NTremblay, NLabelle, M Structure-activity relationship of biaryl acylsulfonamide analogues on the human EP(3) prostanoid receptor. Bioorg Med Chem Lett12:2583-6 (2002) Prostaglandin E2 receptor EP3 subtype
Name:Prostaglandin E2 receptor EP3 subtype
Type:Enzyme
Mol. Mass.:43335.03
Organism:Homo sapiens (Human)
Description:P43115
Residue:390
BDBM50117695
NameBDBM50117695
Synonyms:CHEMBL87263 | Thiophene-2-sulfonic acid {3-[4'-(3-m-tolyloxy-propoxy)-biphenyl-2-yl]-propionyl}-amide
TypeSmall organic molecule
Emp. Form.C29H29NO5S2
Mol. Mass.535.674
SMILESCc1cccc(OCCCOc2ccc(cc2)-c2ccccc2CCC(=O)NS(=O)(=O)c2cccs2)c1