Reaction Details
TargetMelanocortin receptor 4
LigandBDBM50119367
Substrate/Competitorn/a
Meas. Tech.ChEMBL_104238 (CHEMBL884503)
EC50 0.600000±n/a nM
Citation Sebhat, IKMartin, WJYe, ZBarakat, KMosley, RTJohnston, DBBakshi, RPalucki, BWeinberg, DHMacNeil, TKalyani, RNTang, RStearns, RAMiller, RRTamvakopoulos, CStrack, AMMcGowan, ECashen, DEDrisko, JEHom, GJHoward, ADMacIntyre, DEvan der Ploeg, LHPatchett, AANargund, RP Design and pharmacology of N-[(3R)-1,2,3,4-tetrahydroisoquinolinium- 3-ylcarbonyl]-(1R)-1-(4-chlorobenzyl)- 2-[4-cyclohexyl-4-(1H-1,2,4-triazol- 1-ylmethyl)piperidin-1-yl]-2-oxoethylamine (1), a potent, selective, melanocortin subtype-4 receptor agonist. J Med Chem45:4589-93 (2002) Melanocortin receptor 4
Name:Melanocortin receptor 4
Type:Enzyme
Mol. Mass.:36949.50
Organism:Homo sapiens (Human)
Description:P32245
Residue:332
BDBM50119367
NameBDBM50119367
Synonyms:(3R)-N-[(2R)-3-(4-chlorophenyl)-1-{4-cyclohexyl-4-[(1-methyl-1H-1,2,3,4-tetrazol-5-yl)methyl]piperidin-1-yl}-1-oxopropan-2-yl]-1,2,3,4-tetrahydroisoquinoline-3-carboxamide CHEMBL140154
TypeSmall organic molecule
Emp. Form.C33H42ClN7O2
Mol. Mass.604.185
SMILESCn1nnnc1CC1(CCN(CC1)C(=O)[C@@H](Cc1ccc(Cl)cc1)NC(=O)[C@H]1Cc2ccccc2CN1)C1CCCCC1