Reaction Details
TargetDelta-type opioid receptor
LigandBDBM50120057
Substrate/Competitorn/a
Meas. Tech.ChEBML_147337
Ki 349±n/a nM
Citation Roy, CLi, TKrasik, PGilbert, MJPelletier, CGagnon, DRobert, EDucharme, JStorer, RLavallée, JF Synthesis and structure--activity relationship of novel aminotetralin derivatives with high micro selective opioid affinity. Bioorg Med Chem Lett12:3141-3 (2002) Delta-type opioid receptor
Name:Delta-type opioid receptor
Type:G Protein-Coupled Receptor (GPCR)
Mol. Mass.:40382.98
Organism:Homo sapiens (Human)
Description:Competition binding assays were carried out using membrane preparations from transfected HN9.10 cells that constitutively expressed the delta opioid receptor.
Residue:372
BDBM50120057
NameBDBM50120057
Synonyms:7-Amino-8,8-dimethyl-6-methylsulfanyl-5,6,7,8-tetrahydro-naphthalen-2-ol | CHEMBL104169
TypeSmall organic molecule
Emp. Form.C13H19NOS
Mol. Mass.237.361
SMILESCS[C@@H]1Cc2ccc(O)cc2C(C)(C)[C@@H]1N