Reaction Details
TargetMu-type opioid receptor
LigandBDBM50120062
Substrate/Competitorn/a
Meas. Tech.ChEBML_149317
Ki 163±n/a nM
Citation Roy, CLi, TKrasik, PGilbert, MJPelletier, CGagnon, DRobert, EDucharme, JStorer, RLavallée, JF Synthesis and structure--activity relationship of novel aminotetralin derivatives with high micro selective opioid affinity. Bioorg Med Chem Lett12:3141-3 (2002) Mu-type opioid receptor
Name:Mu-type opioid receptor
Type:G Protein-Coupled Receptor (GPCR)
Mol. Mass.:44789.51
Organism:Homo sapiens (Human)
Description:P35372
Residue:400
BDBM50120062
NameBDBM50120062
Synonyms:7-Amino-6-mercapto-8,8-dimethyl-5,6,7,8-tetrahydro-naphthalen-2-ol | CHEMBL104200
TypeSmall organic molecule
Emp. Form.C12H17NOS
Mol. Mass.223.334
SMILESCC1(C)[C@H](N)[C@H](S)Cc2ccc(O)cc12