Reaction Details
TargetcGMP-specific 3',5'-cyclic phosphodiesterase
LigandBDBM50120067
Substrate/Competitorn/a
Meas. Tech.ChEBML_155712
IC50 0.690000±n/a nM
Citation Wang, YChackalamannil, SHu, ZBoyle, CDLankin, CMXia, YXu, RAsberom, TPissarnitski, DStamford, AWGreenlee, WJSkell, JKurowski, SVemulapalli, SPalamanda, JChintala, MWu, PMyers, JWang, P Design and synthesis of xanthine analogues as potent and selective PDE5 inhibitors. Bioorg Med Chem Lett12:3149-52 (2002) cGMP-specific 3',5'-cyclic phosphodiesterase
Name:cGMP-specific 3',5'-cyclic phosphodiesterase
Type:Protein
Mol. Mass.:99975.83
Organism:Homo sapiens (Human)
Description:O76074
Residue:875
BDBM50120067
NameBDBM50120067
Synonyms:8-Cyclopentylamino-1,3-diethyl-7-(3-fluoro-4-methoxy-benzyl)-3,7-dihydro-purine-2,6-dione | CHEMBL108844
TypeSmall organic molecule
Emp. Form.C22H28FN5O3
Mol. Mass.429.4878
SMILESCCn1c2nc(NC3CCCC3)n(Cc3ccc(OC)c(F)c3)c2c(=O)n(CC)c1=O