Reaction Details
TargetcGMP-specific 3',5'-cyclic phosphodiesterase
LigandBDBM50120074
Substrate/Competitorn/a
Meas. Tech.ChEBML_155712
IC50 0.600000±n/a nM
Citation Wang, YChackalamannil, SHu, ZBoyle, CDLankin, CMXia, YXu, RAsberom, TPissarnitski, DStamford, AWGreenlee, WJSkell, JKurowski, SVemulapalli, SPalamanda, JChintala, MWu, PMyers, JWang, P Design and synthesis of xanthine analogues as potent and selective PDE5 inhibitors. Bioorg Med Chem Lett12:3149-52 (2002) cGMP-specific 3',5'-cyclic phosphodiesterase
Name:cGMP-specific 3',5'-cyclic phosphodiesterase
Type:Protein
Mol. Mass.:99975.83
Organism:Homo sapiens (Human)
Description:O76074
Residue:875
BDBM50120074
NameBDBM50120074
Synonyms:8-Cyclohexylamino-1,3-diethyl-7-(4-hydroxy-benzyl)-3,7-dihydro-purine-2,6-dione | CHEMBL107156
TypeSmall organic molecule
Emp. Form.C22H29N5O3
Mol. Mass.411.4974
SMILESCCn1c2nc(NC3CCCCC3)n(Cc3ccc(O)cc3)c2c(=O)n(CC)c1=O