Reaction Details
TargetTyrosine-protein kinase Lck
LigandBDBM50120097
Substrate/Competitorn/a
Meas. Tech.ChEBML_96910
IC50 2.4±n/a nM
Citation Chen, PIwanowicz, EJNorris, DGu, HHLin, JMoquin, RVDas, JWityak, JSpergel, SHde Fex, HPang, SPitt, SShen, DRSchieven, GLBarrish, JC Synthesis and SAR of novel imidazoquinoxaline-based Lck inhibitors: improvement of cell potency. Bioorg Med Chem Lett12:3153-6 (2002) Tyrosine-protein kinase Lck
Name:Tyrosine-protein kinase Lck
Type:n/a
Mol. Mass.:57987.83
Organism:Homo sapiens (Human)
Description:P06239
Residue:509
BDBM50120097
NameBDBM50120097
Synonyms:(7,8-Dimethoxy-imidazo[1,5-a]quinoxalin-4-yl)-(2,6-dimethyl-phenyl)-amine N-(2,6-dimethylphenyl)-7,8-dimethoxyimidazo[1,5-a]quinoxalin-4-amine
TypeSmall organic molecule
Emp. Form.C20H20N4O2
Mol. Mass.348.3984
SMILESCOc1cc2nc(Nc3c(C)cccc3C)c3cncn3c2cc1OC