Reaction Details
TargetTyrosine-protein kinase Lck
LigandBDBM50120116
Substrate/Competitorn/a
Meas. Tech.ChEBML_96910
IC50 1.7±n/a nM
Citation Chen, PIwanowicz, EJNorris, DGu, HHLin, JMoquin, RVDas, JWityak, JSpergel, SHde Fex, HPang, SPitt, SShen, DRSchieven, GLBarrish, JC Synthesis and SAR of novel imidazoquinoxaline-based Lck inhibitors: improvement of cell potency. Bioorg Med Chem Lett12:3153-6 (2002) Tyrosine-protein kinase Lck
Name:Tyrosine-protein kinase Lck
Type:n/a
Mol. Mass.:57987.83
Organism:Homo sapiens (Human)
Description:P06239
Residue:509
BDBM50120116
NameBDBM50120116
Synonyms:CHEMBL108362 N4-(2-chloro-6-methylphenyl)-N7-(2-(dimethylamino)ethyl)-8-methoxyimidazo[1,5-a]quinoxaline-4,7-diamine
TypeSmall organic molecule
Emp. Form.C22H25ClN6O
Mol. Mass.424.927
SMILESCOc1cc2c(cc1NCCN(C)C)nc(Nc1c(C)cccc1Cl)c1cncn21