Reaction Details
TargetTranslocator protein
LigandBDBM50120346
Substrate/Competitorn/a
Meas. Tech.ChEBML_37065
Ki 3572±n/a nM
Citation Pacofsky, GJStafford, JACox, RFCowan, JRDorsey, GFGonzales, SSKaldor, IKoszalka, GWLovell, GGMcIntyre, MSTidwell, JHTodd, DWhitesell, GWiard, RPFeldman, PL Relating the structure, activity, and physical properties of ultrashort-acting benzodiazepine receptor agonists. Bioorg Med Chem Lett12:3219-22 (2002) Translocator protein
Name:Translocator protein
Type:Mitochondrion membrane protein
Mol. Mass.:18945.84
Organism:Rattus norvegicus (rat)
Description:Competitive binding experiments were performed on rat kidney mitochondrial membranes.
Residue:169
BDBM50120346
NameBDBM50120346
Synonyms:3-[(R)-8-Chloro-6-(2-fluoro-phenyl)-1-methyl-4H-2,5,10b-triaza-benzo[e]azulen-4-yl]-propionic acid methyl ester | CHEMBL108709
TypeSmall organic molecule
Emp. Form.C22H19ClFN3O2
Mol. Mass.411.857
SMILESCOC(=O)CC[C@H]1N=C(c2ccccc2F)c2cc(Cl)ccc2-n2c(C)ncc12