Reaction Details
TargetProcathepsin L
LigandBDBM50121287
Substrate/Competitorn/a
Meas. Tech.ChEMBL_48503 (CHEMBL660652)
Ki 490.0±n/a nM
Citation Chowdhury, SFSivaraman, JWang, JDevanathan, GLachance, PQi, HMénard, RLefebvre, JKonishi, YCygler, MSulea, TPurisima, EO Design of noncovalent inhibitors of human cathepsin L. From the 96-residue proregion to optimized tripeptides. J Med Chem45:5321-9 (2002) Procathepsin L
Name:Procathepsin L
Type:Enzyme
Mol. Mass.:37557.19
Organism:Homo sapiens (Human)
Description:Purchased from Calbiochem (San Diego, CA).
Residue:333
BDBM50121287
NameBDBM50121287
Synonyms:2-[2-(2-Biphenyl-4-yl-acetylamino)-pentanoylamino]-5-guanidino-pentanoic acid [1-(1-phenethylcarbamoyl-2-phenyl-ethylcarbamoyl)-2-phenyl-ethyl]-amide | CHEMBL148544
TypeSmall organic molecule
Emp. Form.C51H60N8O5
Mol. Mass.865.0727
SMILESCCCC(NC(=O)Cc1ccc(cc1)-c1ccccc1)C(=O)N[C@H](CCCNC(N)=N)C(=O)NC(Cc1ccccc1)C(=O)NC(Cc1ccccc1)C(=O)NCCc1ccccc1