Reaction Details
TargetProcathepsin L
LigandBDBM50121292
Substrate/Competitorn/a
Meas. Tech.ChEMBL_48503 (CHEMBL660652)
Ki 210±n/a nM
Citation Chowdhury, SFSivaraman, JWang, JDevanathan, GLachance, PQi, HMénard, RLefebvre, JKonishi, YCygler, MSulea, TPurisima, EO Design of noncovalent inhibitors of human cathepsin L. From the 96-residue proregion to optimized tripeptides. J Med Chem45:5321-9 (2002) Procathepsin L
Name:Procathepsin L
Type:Enzyme
Mol. Mass.:37557.19
Organism:Homo sapiens (Human)
Description:Purchased from Calbiochem (San Diego, CA).
Residue:333
BDBM50121292
NameBDBM50121292
Synonyms:2-[2-(2-Biphenyl-4-yl-acetylamino)-3-methylsulfanyl-propionylamino]-5-guanidino-pentanoic acid {2-phenyl-1-[2-phenyl-1-(3-phenyl-propylcarbamoyl)-ethylcarbamoyl]-ethyl}-amide | CHEMBL148943
TypeSmall organic molecule
Emp. Form.C51H60N8O5S
Mol. Mass.897.138
SMILESCSCC(NC(=O)Cc1ccc(cc1)-c1ccccc1)C(=O)N[C@H](CCCNC(N)=N)C(=O)NC(Cc1ccccc1)C(=O)NC(Cc1ccccc1)C(=O)NCCCc1ccccc1