Reaction Details
TargetProcathepsin L
LigandBDBM50121293
Substrate/Competitorn/a
Meas. Tech.ChEMBL_48503 (CHEMBL660652)
Ki 270±n/a nM
Citation Chowdhury, SFSivaraman, JWang, JDevanathan, GLachance, PQi, HMénard, RLefebvre, JKonishi, YCygler, MSulea, TPurisima, EO Design of noncovalent inhibitors of human cathepsin L. From the 96-residue proregion to optimized tripeptides. J Med Chem45:5321-9 (2002) Procathepsin L
Name:Procathepsin L
Type:Enzyme
Mol. Mass.:37557.19
Organism:Homo sapiens (Human)
Description:Purchased from Calbiochem (San Diego, CA).
Residue:333
BDBM50121293
NameBDBM50121293
Synonyms:2-[2-(2-Biphenyl-4-yl-acetylamino)-3-mercapto-propionylamino]-5-guanidino-pentanoic acid (2-biphenyl-4-yl-1-phenethylcarbamoyl-ethyl)-amide | CHEMBL146795
TypeSmall organic molecule
Emp. Form.C46H51N7O4S
Mol. Mass.798.007
SMILESNC(=N)NCCCC(NC(=O)C(CS)NC(=O)Cc1ccc(cc1)-c1ccccc1)C(=O)NC(Cc1ccc(cc1)-c1ccccc1)C(=O)NCCc1ccccc1