Reaction Details
TargetProcathepsin L
LigandBDBM50121301
Substrate/Competitorn/a
Meas. Tech.ChEMBL_48503 (CHEMBL660652)
Ki 200±n/a nM
Citation Chowdhury, SFSivaraman, JWang, JDevanathan, GLachance, PQi, HMénard, RLefebvre, JKonishi, YCygler, MSulea, TPurisima, EO Design of noncovalent inhibitors of human cathepsin L. From the 96-residue proregion to optimized tripeptides. J Med Chem45:5321-9 (2002) Procathepsin L
Name:Procathepsin L
Type:Enzyme
Mol. Mass.:37557.19
Organism:Homo sapiens (Human)
Description:Purchased from Calbiochem (San Diego, CA).
Residue:333
BDBM50121301
NameBDBM50121301
Synonyms:5-Amino-2-[2-(2-biphenyl-4-yl-acetylamino)-3-methylsulfanyl-propionylamino]-pentanoic acid [1-(1-phenethylcarbamoyl-2-phenyl-ethylcarbamoyl)-2-phenyl-ethyl]-amide | CHEMBL356460
TypeSmall organic molecule
Emp. Form.C49H56N6O5S
Mol. Mass.841.071
SMILESCSCC(NC(=O)Cc1ccc(cc1)-c1ccccc1)C(=O)N[C@H](CCCN)C(=O)NC(Cc1ccccc1)C(=O)NC(Cc1ccccc1)C(=O)NCCc1ccccc1