Reaction Details
TargetGag-Pol polyprotein [489-587]
LigandBDBM50121733
Substrate/Competitorn/a
Meas. Tech.ChEBML_79946
Ki 5±n/a nM
Citation Hidaka, KKimura, THayashi, YMcDaniel, KFDekhtyar, TColletti, LKiso, Y Design and synthesis of pseudo-symmetric HIV protease inhibitors containing a novel hydroxymethylcarbonyl (HMC)-hydrazide isostere. Bioorg Med Chem Lett13:93-6 (2002) Gag-Pol polyprotein [489-587]
Name:Gag-Pol polyprotein [489-587]
Type:Enzyme Subunit
Mol. Mass.:10781.16
Organism:Human immunodeficiency virus type 1
Description:P04585[489-587]
Residue:99
BDBM50121733
NameBDBM50121733
Synonyms:2-(4-Amino-2,6-dimethyl-phenoxy)-N-[(S)-3-[N-benzyl-N'-(3-hydroxy-2-methyl-benzoyl)-hydrazino]-2-hydroxy-3-oxo-1-((S)-phenylmethyl)-propyl]-acetamide KNI-1166
TypeSmall organic molecule
Emp. Form.C35H38N4O6
Mol. Mass.610.6994
SMILESCc1cc(N)cc(C)c1OCC(=O)N[C@@H](Cc1ccccc1)[C@H](O)C(=O)N(Cc1ccccc1)NC(=O)c1cccc(O)c1C