Reaction Details
TargetGlutamate receptor 1
LigandBDBM50122085
Substrate/Competitorn/a
Meas. Tech.ChEMBL_72845 (CHEMBL680870)
Ki 88.0±n/a nM
Citation Kromann, HKrikstolaityte, SAndersen, AJAndersen, KKrogsgaard-Larsen, PJaroszewski, JWEgebjerg, JStrømgaard, K Solid-phase synthesis of polyamine toxin analogues: potent and selective antagonists of Ca2+-permeable AMPA receptors. J Med Chem45:5745-54 (2002) Glutamate receptor 1
Name:Glutamate receptor 1
Type:Enzyme Catalytic Domain
Mol. Mass.:101512.92
Organism:Homo sapiens (Human)
Description:Glutamate AMPA 1 GRIA1 HUMAN::P42261
Residue:906
BDBM50122085
NameBDBM50122085
Synonyms:CHEMBL152425 | N-[1-[8-(3-Amino-propylamino)-octylcarbamoyl]-2-(4-hydroxy-phenyl)-ethyl]-nicotinamide
TypeSmall organic molecule
Emp. Form.C26H39N5O3
Mol. Mass.469.6196
(=O)C(Cc1ccc(O)cc1)NC(=O)c1cccnc1