Reaction Details
TargetGlutamate receptor 1
LigandBDBM50122086
Substrate/Competitorn/a
Meas. Tech.ChEMBL_72845 (CHEMBL680870)
Ki 90±n/a nM
Citation Kromann, HKrikstolaityte, SAndersen, AJAndersen, KKrogsgaard-Larsen, PJaroszewski, JWEgebjerg, JStrømgaard, K Solid-phase synthesis of polyamine toxin analogues: potent and selective antagonists of Ca2+-permeable AMPA receptors. J Med Chem45:5745-54 (2002) Glutamate receptor 1
Name:Glutamate receptor 1
Type:Enzyme Catalytic Domain
Mol. Mass.:101512.92
Organism:Homo sapiens (Human)
Description:Glutamate AMPA 1 GRIA1 HUMAN::P42261
Residue:906
BDBM50122086
NameBDBM50122086
Synonyms:CHEMBL269192 | N-[1-[8-(3-Amino-propylamino)-octylcarbamoyl]-2-(4-hydroxy-phenyl)-ethyl]-2,2-dimethyl-propionamide
TypeSmall organic molecule
Emp. Form.C25H44N4O3
Mol. Mass.448.6419
SMILESCC(C)(C)C(=O)NC(Cc1ccc(O)cc1)C(=O)NCCCCCCCCNCCCN