Reaction Details
TargetGlutamate receptor 1
LigandBDBM50122093
Substrate/Competitorn/a
Meas. Tech.ChEMBL_72844 (CHEMBL680869)
Ki 135±n/a nM
Citation Kromann, HKrikstolaityte, SAndersen, AJAndersen, KKrogsgaard-Larsen, PJaroszewski, JWEgebjerg, JStrømgaard, K Solid-phase synthesis of polyamine toxin analogues: potent and selective antagonists of Ca2+-permeable AMPA receptors. J Med Chem45:5745-54 (2002) Glutamate receptor 1
Name:Glutamate receptor 1
Type:Enzyme Catalytic Domain
Mol. Mass.:101512.92
Organism:Homo sapiens (Human)
Description:Glutamate AMPA 1 GRIA1 HUMAN::P42261
Residue:906
BDBM50122093
NameBDBM50122093
Synonyms:CHEMBL152879 | N-[1-[4-(7-Amino-heptylamino)-butylcarbamoyl]-2-(4-hydroxy-phenyl)-ethyl]-butyramide
TypeSmall organic molecule
Emp. Form.C24H42N4O3
Mol. Mass.434.6153
SMILESCCCC(=O)NC(Cc1ccc(O)cc1)C(=O)NCCCCNCCCCCCCN