Reaction Details
TargetGlutamate receptor 1
LigandBDBM50122095
Substrate/Competitorn/a
Meas. Tech.ChEMBL_72845 (CHEMBL680870)
Ki 100±n/a nM
Citation Kromann, HKrikstolaityte, SAndersen, AJAndersen, KKrogsgaard-Larsen, PJaroszewski, JWEgebjerg, JStrømgaard, K Solid-phase synthesis of polyamine toxin analogues: potent and selective antagonists of Ca2+-permeable AMPA receptors. J Med Chem45:5745-54 (2002) Glutamate receptor 1
Name:Glutamate receptor 1
Type:Enzyme Catalytic Domain
Mol. Mass.:101512.92
Organism:Homo sapiens (Human)
Description:Glutamate AMPA 1 GRIA1 HUMAN::P42261
Residue:906
BDBM50122095
NameBDBM50122095
Synonyms:CHEMBL355977 | N-[8-(3-Amino-propylamino)-octyl]-3-(4-hydroxy-phenyl)-2-propionylamino-propionamide
TypeSmall organic molecule
Emp. Form.C23H40N4O3
Mol. Mass.420.5887
SMILESCCC(=O)NC(Cc1ccc(O)cc1)C(=O)NCCCCCCCCNCCCN