Reaction Details
TargetGlutamate receptor 1
LigandBDBM50122096
Substrate/Competitorn/a
Meas. Tech.ChEMBL_72845 (CHEMBL680870)
Ki 68.0±n/a nM
Citation Kromann, HKrikstolaityte, SAndersen, AJAndersen, KKrogsgaard-Larsen, PJaroszewski, JWEgebjerg, JStrømgaard, K Solid-phase synthesis of polyamine toxin analogues: potent and selective antagonists of Ca2+-permeable AMPA receptors. J Med Chem45:5745-54 (2002) Glutamate receptor 1
Name:Glutamate receptor 1
Type:Enzyme Catalytic Domain
Mol. Mass.:101512.92
Organism:Homo sapiens (Human)
Description:Glutamate AMPA 1 GRIA1 HUMAN::P42261
Residue:906
BDBM50122096
NameBDBM50122096
Synonyms:CHEMBL152410 | Hexanoic acid [1-[8-(3-amino-propylamino)-octylcarbamoyl]-2-(4-hydroxy-phenyl)-ethyl]-amide
TypeSmall organic molecule
Emp. Form.C26H46N4O3
Mol. Mass.462.6684
SMILESCCCCCC(=O)NC(Cc1ccc(O)cc1)C(=O)NCCCCCCCCNCCCN