Reaction Details
TargetMethionine--tRNA ligase
LigandBDBM50124801
Substrate/Competitorn/a
Meas. Tech.ChEMBL_105150 (CHEMBL716780)
IC50 5.1±n/a nM
Citation Jarvest, RLBerge, JMBrown, MJBrown, PElder, JSForrest, AKHouge-Frydrych, CSO'Hanlon, PJMcNair, DJRittenhouse, SSheppard, RJ Optimisation of aryl substitution leading to potent methionyl tRNA synthetase inhibitors with excellent gram-positive antibacterial activity. Bioorg Med Chem Lett13:665-8 (2003) Methionine--tRNA ligase
Name:Methionine--tRNA ligase
Type:PROTEIN
Mol. Mass.:76245.79
Organism:Escherichia coli (strain K12)
Description:ChEMBL_400681
Residue:677
BDBM50124801
NameBDBM50124801
Synonyms:2-[3-(4,6-Dichloro-indan-1-ylamino)-propylamino]-1H-quinolin-4-one TCMDC-139485
TypeSmall organic molecule
Emp. Form.C21H21Cl2N3O
Mol. Mass.402.317
SMILESOc1cc(NCCCNC2CCc3c2cc(Cl)cc3Cl)nc2ccccc12