Reaction Details
TargetMethionine--tRNA ligase
LigandBDBM50124810
Substrate/Competitorn/a
Meas. Tech.ChEMBL_105150 (CHEMBL716780)
IC50 6.8±n/a nM
Citation Jarvest, RLBerge, JMBrown, MJBrown, PElder, JSForrest, AKHouge-Frydrych, CSO'Hanlon, PJMcNair, DJRittenhouse, SSheppard, RJ Optimisation of aryl substitution leading to potent methionyl tRNA synthetase inhibitors with excellent gram-positive antibacterial activity. Bioorg Med Chem Lett13:665-8 (2003) Methionine--tRNA ligase
Name:Methionine--tRNA ligase
Type:PROTEIN
Mol. Mass.:76245.79
Organism:Escherichia coli (strain K12)
Description:ChEMBL_400681
Residue:677
BDBM50124810
NameBDBM50124810
Synonyms:2-[3-(5-Chloro-2-ethoxy-3-methyl-benzylamino)-propylamino]-1H-quinolin-4-one | CHEMBL158513
TypeSmall organic molecule
Emp. Form.C22H26ClN3O2
Mol. Mass.399.914
SMILESCCOc1c(C)cc(Cl)cc1CNCCCNc1cc(O)c2ccccc2n1