Reaction Details
TargetMethionine--tRNA ligase
LigandBDBM50124854
Substrate/Competitorn/a
Meas. Tech.ChEBML_105151
IC50 4.3±n/a nM
Citation Jarvest, RLBerge, JMBrown, MJBrown, PElder, JSForrest, AKHouge-Frydrych, CSO'Hanlon, PJMcNair, DJRittenhouse, SSheppard, RJ Optimisation of aryl substitution leading to potent methionyl tRNA synthetase inhibitors with excellent gram-positive antibacterial activity. Bioorg Med Chem Lett13:665-8 (2003) Methionine--tRNA ligase
Name:Methionine--tRNA ligase
Type:PROTEIN
Mol. Mass.:76245.79
Organism:Escherichia coli (strain K12)
Description:ChEMBL_400681
Residue:677
BDBM50124854
NameBDBM50124854
Synonyms:2-[3-(3-Chloro-2-ethoxy-5-methoxy-benzylamino)-propylamino]-1H-quinolin-4-one | CHEMBL158678
TypeSmall organic molecule
Emp. Form.C22H26ClN3O3
Mol. Mass.415.913
SMILESCCOc1c(Cl)cc(OC)cc1CNCCCNc1cc(O)c2ccccc2n1