Reaction Details
TargetMethionine--tRNA ligase
LigandBDBM50222705
Substrate/Competitorn/a
Meas. Tech.ChEMBL_105151 (CHEMBL878223)
IC50<3±n/a nM
Citation Jarvest, RLBerge, JMBrown, MJBrown, PElder, JSForrest, AKHouge-Frydrych, CSO'Hanlon, PJMcNair, DJRittenhouse, SSheppard, RJ Optimisation of aryl substitution leading to potent methionyl tRNA synthetase inhibitors with excellent gram-positive antibacterial activity. Bioorg Med Chem Lett13:665-8 (2003) Methionine--tRNA ligase
Name:Methionine--tRNA ligase
Type:PROTEIN
Mol. Mass.:76245.79
Organism:Escherichia coli (strain K12)
Description:ChEMBL_400681
Residue:677
BDBM50222705
NameBDBM50222705
Synonyms:CHEMBL161312
TypeSmall organic molecule
Emp. Form.C21H23I2N3O2
Mol. Mass.603.2352
SMILESCCOc1c(I)cc(I)cc1CNCCCNc1cc(O)c2ccccc2n1