Reaction Details
TargetCoagulation factor X
LigandBDBM50124995
Substrate/Competitorn/a
Meas. Tech.ChEMBL_48972 (CHEMBL663502)
IC50 2±n/a nM
Citation Huang, WNaughton, MAYang, HSu, TDam, SWong, PWArfsten, AEdwards, SSinha, UHollenbach, SScarborough, RMZhu, BY Design, synthesis, and structure-activity relationships of unsubstituted piperazinone-based transition state factor Xa inhibitors. Bioorg Med Chem Lett13:723-8 (2003) Coagulation factor X
Name:Coagulation factor X
Type:Enzyme
Mol. Mass.:54726.60
Organism:Homo sapiens (Human)
Description:n/a
Residue:488
BDBM50124995
NameBDBM50124995
Synonyms:2-[4-(4-Chloro-benzenesulfonyl)-2-oxo-piperazin-1-yl]-N-[(R)-4-guanidino-1-(thiazole-2-carbonyl)-butyl]-acetamide | CHEMBL159695
TypeSmall organic molecule
Emp. Form.C21H26ClN7O5S2
Mol. Mass.556.058
SMILESNC(=N)NCCC[C@@H](NC(=O)CN1CCN(CC1=O)S(=O)(=O)c1ccc(Cl)cc1)C(=O)c1nccs1