Reaction Details
TargetVitamin K-dependent protein C
LigandBDBM50124975
Substrate/Competitorn/a
Meas. Tech.ChEBML_27859
IC50 169000±n/a nM
Citation Huang, WNaughton, MAYang, HSu, TDam, SWong, PWArfsten, AEdwards, SSinha, UHollenbach, SScarborough, RMZhu, BY Design, synthesis, and structure-activity relationships of unsubstituted piperazinone-based transition state factor Xa inhibitors. Bioorg Med Chem Lett13:723-8 (2003) Vitamin K-dependent protein C
Name:Vitamin K-dependent protein C
Type:Enzyme
Mol. Mass.:52067.73
Organism:Homo sapiens (Human)
Description:n/a
Residue:461
BDBM50124975
NameBDBM50124975
Synonyms:2-[4-(5-Chloro-3-methyl-benzo[b]thiophene-2-sulfonyl)-2-oxo-piperazin-1-yl]-N-[4-guanidino-1-(thiazole-2-carbonyl)-butyl]-acetamide | CHEMBL423810
TypeSmall organic molecule
Emp. Form.C24H28ClN7O5S3
Mol. Mass.626.171
SMILESCc1c(sc2ccc(Cl)cc12)S(=O)(=O)N1CCN(CC(=O)NC(CCCNC(N)=N)C(=O)c2nccs2)C(=O)C1