Reaction Details
TargetcAMP-specific 3',5'-cyclic phosphodiesterase 4A
LigandBDBM50125072
Substrate/Competitorn/a
Meas. Tech.ChEBML_155034
IC50 1.7±n/a nM
Citation Côté, BFrenette, RPrescott, SBlouin, MBrideau, CDucharme, YFriesen, RWLaliberté, FMasson, PStyhler, AGirard, Y Substituted aminopyridines as potent and selective phosphodiesterase-4 inhibitors. Bioorg Med Chem Lett13:741-4 (2003) cAMP-specific 3',5'-cyclic phosphodiesterase 4A
Name:cAMP-specific 3',5'-cyclic phosphodiesterase 4A
Type:Enzyme
Mol. Mass.:98113.27
Organism:Homo sapiens (Human)
Description:P27815
Residue:886
BDBM50125072
NameBDBM50125072
Synonyms:CHEMBL166299 | {5-[1-(3,4-Bis-difluoromethoxy-phenyl)-2-(1-oxy-pyridin-4-yl)-ethyl]-pyridin-2-yl}-((R)-1-phenyl-ethyl)-amine
TypeSmall organic molecule
Emp. Form.C28H25F4N3O3
Mol. Mass.527.51
SMILESC[C@@H](Nc1ccc(cn1)C(Cc1cc[n+]([O-])cc1)c1ccc(OC(F)F)c(OC(F)F)c1)c1ccccc1