Reaction Details
TargetcAMP-specific 3',5'-cyclic phosphodiesterase 4A
LigandBDBM50113425
Substrate/Competitorn/a
Meas. Tech.ChEBML_155034
IC50 4.2±n/a nM
Citation Côté, BFrenette, RPrescott, SBlouin, MBrideau, CDucharme, YFriesen, RWLaliberté, FMasson, PStyhler, AGirard, Y Substituted aminopyridines as potent and selective phosphodiesterase-4 inhibitors. Bioorg Med Chem Lett13:741-4 (2003) cAMP-specific 3',5'-cyclic phosphodiesterase 4A
Name:cAMP-specific 3',5'-cyclic phosphodiesterase 4A
Type:Enzyme
Mol. Mass.:98113.27
Organism:Homo sapiens (Human)
Description:P27815
Residue:886
BDBM50113425
NameBDBM50113425
Synonyms:2-{4-[1-(3,4-Bis-difluoromethoxy-phenyl)-2-(1-oxy-pyridin-4-yl)-ethyl]-phenyl}-1,1,1,3,3,3-hexafluoro-propan-2-ol CHEMBL286224 | L-791943
TypeSmall organic molecule
Emp. Form.C24H17F10NO4
Mol. Mass.573.3801
SMILESOC(c1ccc(cc1)C(Cc1cc[n+]([O-])cc1)c1ccc(OC(F)F)c(OC(F)F)c1)(C(F)(F)F)C(F)(F)F