Reaction Details
TargetPlatelet-activating factor acetylhydrolase
LigandBDBM50125265
Substrate/Competitorn/a
Meas. Tech.ChEMBL_101018 (CHEMBL708029)
Ki 0.110±n/a nM
Citation Blackie, JABloomer, JCBrown, MJCheng, HYHammond, BHickey, DMIfe, RJLeach, CALewis, VAMacphee, CHMilliner, KJMoores, KEPinto, ILSmith, SAStansfield, IGStanway, SJTaylor, MATheobald, CJ The identification of clinical candidate SB-480848: a potent inhibitor of lipoprotein-associated phospholipase A2. Bioorg Med Chem Lett13:1067-70 (2003) Platelet-activating factor acetylhydrolase
Name:Platelet-activating factor acetylhydrolase
Type:PROTEIN
Mol. Mass.:50084.41
Organism:Homo sapiens (Human)
Description:ChEMBL_156212
Residue:441
BDBM50125265
NameBDBM50125265
Synonyms:CHEMBL204021 | N-(2-Diethylamino-ethyl)-2-[2-(4-fluoro-benzylsulfanyl)-4-oxo-4,5,6,7-tetrahydro-cyclopentapyrimidin-1-yl]-N-(4'-trifluoromethyl-biphenyl-4-ylmethyl)-acetamide
TypeSmall organic molecule
Emp. Form.C36H38F4N4O2S
Mol. Mass.666.771
SMILESCCN(CC)CCN(Cc1ccc(cc1)-c1ccc(cc1)C(F)(F)F)C(=O)Cn1c2CCCc2c(=O)nc1SCc1ccc(F)cc1