Reaction Details
TargetMitogen-activated protein kinase 14
LigandBDBM50125604
Substrate/Competitorn/a
Meas. Tech.ChEBML_124636
IC50 16±n/a nM
Citation Wan, ZBoehm, JCBower, MJKassis, SLee, JCZhao, BAdams, JL N-Phenyl-N-purin-6-yl ureas: the design and synthesis of p38alpha MAP kinase inhibitors. Bioorg Med Chem Lett13:1191-4 (2003) Mitogen-activated protein kinase 14
Name:Mitogen-activated protein kinase 14
Type:Serine/threonine-protein kinase
Mol. Mass.:41286.76
Organism:Homo sapiens (Human)
Description:Q16539
Residue:360
BDBM50125604
NameBDBM50125604
Synonyms:1-[9-Benzyl-2-(2-fluoro-phenyl)-9H-purin-6-yl]-1-(2,6-difluoro-phenyl)-urea | CHEMBL17131
TypeSmall organic molecule
Emp. Form.C25H17F3N6O
Mol. Mass.474.4373
SMILESNC(=O)N(c1nc(nc2n(Cc3ccccc3)cnc12)-c1ccccc1F)c1c(F)cccc1F