Reaction Details
TargetGlutamate carboxypeptidase 2
LigandBDBM17659
Substrate/Competitorn/a
Meas. Tech.ChEMBL_71703 (CHEMBL680917)
IC50 0.3±n/a nM
Citation Majer, PJackson, PFDelahanty, GGrella, BSKo, YSLi, WLiu, QMaclin, KMPoláková, JShaffer, KAStoermer, DVitharana, DWang, EYZakrzewski, ARojas, CSlusher, BSWozniak, KMBurak, ELimsakun, TTsukamoto, T Synthesis and biological evaluation of thiol-based inhibitors of glutamate carboxypeptidase II: discovery of an orally active GCP II inhibitor. J Med Chem46:1989-96 (2003) 
 
Glutamate carboxypeptidase 2
Name:Glutamate carboxypeptidase 2
Type:PROTEIN
Mol. Mass.:84333.66
Organism:Homo sapiens (Human)
Description:ChEMBL_1497035
Residue:750
BDBM17659
NameBDBM17659
Synonyms:(R,S)-2-phosphonomethylpentanedioic acid 2-PMPA US10894807, ID P009 | pentanedioic acid analogue, (RS)-1
TypeSmall organic molecule
Emp. Form.C6H11O7P
Mol. Mass.226.1211
SMILESOC(=O)CCC(CP(O)(O)=O)C(O)=O